Reaction Details
TargetAdenosine receptor A2a
LigandBDBM50151208
Substrate/Competitorn/a
Meas. Tech.ChEMBL_303190 (CHEMBL829684)
Ki 18±n/a nM
Citation Vu, CBPeng, BKumaravel, GSmits, GJin, XPhadke, DEngber, THuang, CReilly, JTam, SGrant, DHetu, GChen, LZhang, JPetter, RC Piperazine derivatives of [1,2,4]triazolo[1,5-a][1,3,5]triazine as potent and selective adenosine A2a receptor antagonists. J Med Chem47:4291-9 (2004) 
 
Adenosine receptor A2a
Name:Adenosine receptor A2a
Type:G Protein-Coupled Receptor (GPCR)
Mol. Mass.:45015.65
Organism:Rattus norvegicus (rat)
Description:Rat A2A receptors expressed in CHO cells.
Residue:410
BDBM50151208
NameBDBM50151208
Synonyms:2-Furan-2-yl-5-[4-(2,3,6-trichloro-benzyl)-piperazin-1-yl]-[1,2,4]triazolo[1,5-a][1,3,5]triazin-7-ylamine | CHEMBL188424
TypeSmall organic molecule
Emp. Form.C19H17Cl3N8O
Mol. Mass.479.75
SMILESNc1nc(nc2nc(nn12)-c1ccco1)N1CCN(Cc2c(Cl)ccc(Cl)c2Cl)CC1