Reaction Details
TargetRetinoic acid receptor RXR-alpha
LigandBDBM50151231
Substrate/Competitorn/a
Meas. Tech.ChEMBL_306707 (CHEMBL832609)
IC50 120±n/a nM
Citation Cavasotto, CNLiu, GJames, SYHobbs, PDPeterson, VJBhattacharya, AAKolluri, SKZhang, XKLeid, MAbagyan, RLiddington, RCDawson, MI Determinants of retinoid X receptor transcriptional antagonism. J Med Chem47:4360-72 (2004) 
 
Retinoic acid receptor RXR-alpha
Name:Retinoic acid receptor RXR-alpha
Type:PROTEIN
Mol. Mass.:50820.38
Organism:Homo sapiens (Human)
Description:ChEMBL_1456363
Residue:462
BDBM50151231
NameBDBM50151231
Synonyms:4-[Cyclopropylidene-(5,5,8,8-tetramethyl-3-propoxy-5,6,7,8-tetrahydro-naphthalen-2-yl)-methyl]-benzoic acid | CHEMBL187021
TypeSmall organic molecule
Emp. Form.C28H34O3
Mol. Mass.418.5678
SMILES[#6]-[#6]-[#6]-[#8]-c1cc2c(cc1\[#6](=[#6]-1\[#6]-[#6]-1)-c1ccc(cc1)-[#6](-[#8])=O)C([#6])([#6])[#6]-[#6]C2([#6])[#6]