Reaction Details
TargetTGF-beta receptor type-1
LigandBDBM50151346
Substrate/Competitorn/a
Meas. Tech.ChEMBL_306806 (CHEMBL831713)
IC50 40±n/a nM
Citation Gellibert, FWoolven, JFouchet, MHMathews, NGoodland, HLovegrove, VLaroze, ANguyen, VLSautet, SWang, RJanson, CSmith, WKrysa, GBoullay, VDe Gouville, ACHuet, SHartley, D Identification of 1,5-naphthyridine derivatives as a novel series of potent and selective TGF-beta type I receptor inhibitors. J Med Chem47:4494-506 (2004) 
 
TGF-beta receptor type-1
Name:TGF-beta receptor type-1
Type:enzyme
Mol. Mass.:55968.24
Organism:Homo sapiens (Human)
Description:P36897
Residue:503
BDBM50151346
NameBDBM50151346
Synonyms:5-(1,5-naphthyridin-2-yl)-4-(pyridin-2-yl)thiazol-2-amine CHEMBL181361
TypeSmall organic molecule
Emp. Form.C16H11N5S
Mol. Mass.305.357
SMILESNc1nc(c(s1)-c1ccc2ncccc2n1)-c1ccccn1