Reaction Details
TargetInhibitor of nuclear factor kappa-B kinase subunit alpha
LigandBDBM50151366
Substrate/Competitorn/a
Meas. Tech.ChEMBL_306204 (CHEMBL830162)
IC50>10000±n/a nM
Citation Chen, PDoweyko, AMNorris, DGu, HHSpergel, SHDas, JMoquin, RVLin, JWityak, JIwanowicz, EJMcIntyre, KWShuster, DJBehnia, KChong, Sde Fex, HPang, SPitt, SShen, DRThrall, SStanley, PKocy, ORWitmer, MRKanner, SBSchieven, GLBarrish, JC Imidazoquinoxaline Src-family kinase p56Lck inhibitors: SAR, QSAR, and the discovery of (S)-N-(2-chloro-6-methylphenyl)-2-(3-methyl-1-piperazinyl)imidazo- [1,5-a]pyrido[3,2-e]pyrazin-6-amine (BMS-279700) as a potent and orally active inhibitor with excellent in vivo antiinflammatory activity. J Med Chem47:4517-29 (2004) 
 
Inhibitor of nuclear factor kappa-B kinase subunit alpha
Name:Inhibitor of nuclear factor kappa-B kinase subunit alpha
Type:PROTEIN
Mol. Mass.:84642.21
Organism:Homo sapiens (Human)
Description:ChEMBL_327453
Residue:745
BDBM50151366
NameBDBM50151366
Synonyms:(2-Chloro-6-methyl-phenyl)-[8-((S)-3-methyl-piperazin-1-yl)-2,5,9,9b-tetraaza-cyclopenta[a]naphthalen-4-yl]-amine CHEMBL189338
TypeSmall organic molecule
Emp. Form.C21H22ClN7
Mol. Mass.407.899
SMILESC[C@H]1CN(CCN1)c1ccc2nc(Nc3c(C)cccc3Cl)c3cncn3c2n1