Reaction Details
TargetMetabotropic glutamate receptor 2
LigandBDBM50151437
Substrate/Competitorn/a
Meas. Tech.ChEMBL_303460 (CHEMBL839720)
Ki 5.81±n/a nM
Citation Nakazato, ASakagami, KYasuhara, AOhta, HYoshikawa, RItoh, MNakamura, MChaki, S Synthesis, in vitro pharmacology, structure-activity relationships, and pharmacokinetics of 3-alkoxy-2-amino-6-fluorobicyclo[3.1.0]hexane-2,6-dicarboxylic acid derivatives as potent and selective group II metabotropic glutamate receptor antagonists. J Med Chem47:4570-87 (2004) 
 
Metabotropic glutamate receptor 2
Name:Metabotropic glutamate receptor 2
Type:Enzyme
Mol. Mass.:95584.88
Organism:Homo sapiens (Human)
Description:Q14416
Residue:872
BDBM50151437
NameBDBM50151437
Synonyms:(1R,2R,3R,5R,6R)-2-Amino-3-[(S)-1-(3,4-dichloro-phenyl)-ethoxy]-6-fluoro-bicyclo[3.1.0]hexane-2,6-dicarboxylic acid | CHEMBL183073
TypeSmall organic molecule
Emp. Form.C16H16Cl2FNO5
Mol. Mass.392.206
SMILESC[C@H](O[C@@H]1C[C@@H]2[C@@H]([C@@]2(F)C(O)=O)[C@]1(N)C(O)=O)c1ccc(Cl)c(Cl)c1