Reaction Details
TargetMetabotropic glutamate receptor 2
LigandBDBM50151463
Substrate/Competitorn/a
Meas. Tech.ChEMBL_303460 (CHEMBL839720)
Ki 4.35±n/a nM
Citation Nakazato, ASakagami, KYasuhara, AOhta, HYoshikawa, RItoh, MNakamura, MChaki, S Synthesis, in vitro pharmacology, structure-activity relationships, and pharmacokinetics of 3-alkoxy-2-amino-6-fluorobicyclo[3.1.0]hexane-2,6-dicarboxylic acid derivatives as potent and selective group II metabotropic glutamate receptor antagonists. J Med Chem47:4570-87 (2004) 
 
Metabotropic glutamate receptor 2
Name:Metabotropic glutamate receptor 2
Type:Enzyme
Mol. Mass.:95584.88
Organism:Homo sapiens (Human)
Description:Q14416
Residue:872
BDBM50151463
NameBDBM50151463
Synonyms:(1R,2R,3R,5R,6R)-2-Amino-3-(2,3-dichloro-benzyloxy)-6-fluoro-bicyclo[3.1.0]hexane-2,6-dicarboxylic acid | CHEMBL186107
TypeSmall organic molecule
Emp. Form.C15H14Cl2FNO5
Mol. Mass.378.18
SMILESN[C@@]1([C@H]2[C@@H](C[C@H]1OCc1cccc(Cl)c1Cl)[C@]2(F)C(O)=O)C(O)=O