Reaction Details
TargetMetabotropic glutamate receptor 6
LigandBDBM50062522
Substrate/Competitorn/a
Meas. Tech.ChEMBL_306010 (CHEMBL833526)
IC50 1140±n/a nM
Citation Nakazato, ASakagami, KYasuhara, AOhta, HYoshikawa, RItoh, MNakamura, MChaki, S Synthesis, in vitro pharmacology, structure-activity relationships, and pharmacokinetics of 3-alkoxy-2-amino-6-fluorobicyclo[3.1.0]hexane-2,6-dicarboxylic acid derivatives as potent and selective group II metabotropic glutamate receptor antagonists. J Med Chem47:4570-87 (2004) 
 
Metabotropic glutamate receptor 6
Name:Metabotropic glutamate receptor 6
Type:Enzyme
Mol. Mass.:95095.82
Organism:Rattus norvegicus (Rat)
Description:P35349
Residue:871
BDBM50062522
NameBDBM50062522
Synonyms:(1S,2S)-2-((S)-1-amino-1-carboxy-2-(9H-xanthen-9-yl)ethyl)cyclopropanecarboxylic acid (1S,2S)-2-[(S)-1-Amino-1-carboxy-2-(9H-xanthen-9-yl)-ethyl]-cyclopropanecarboxylic acid (S)-2-[(S)-1-Amino-1-carboxy-2-(9H-xanthen-9-yl)-ethyl]-cyclopropanecarboxylic acid 2-[1-Amino-1-carboxy-2-(9H-xanthen-9-yl)-ethyl]-cyclopropanecarboxylic acid(LY341495) | CHEMBL432038
TypeSmall organic molecule
Emp. Form.C20H19NO5
Mol. Mass.353.3686
SMILESN[C@@](CC1c2ccccc2Oc2ccccc12)([C@H]1C[C@@H]1C(O)=O)C(O)=O