Reaction Details
TargetMelanocortin receptor 4
LigandBDBM50151508
Substrate/Competitorn/a
Meas. Tech.ChEMBL_302997 (CHEMBL830236)
Ki 57000±n/a nM
Citation Mutulis, FYahorava, SMutule, IYahorau, ALiepinsh, EKopantshuk, SVeiksina, STars, KBelyakov, SMishnev, ARinken, AWikberg, JE New substituted piperazines as ligands for melanocortin receptors. Correlation to the X-ray structure of"THIQ". J Med Chem47:4613-26 (2004) 
 
Melanocortin receptor 4
Name:Melanocortin receptor 4
Type:Enzyme
Mol. Mass.:36949.50
Organism:Homo sapiens (Human)
Description:P32245
Residue:332
BDBM50151508
NameBDBM50151508
Synonyms:1,2,3,4-Tetrahydro-isoquinoline-3-carboxylic acid [(R)-1-(4-chloro-benzyl)-2-(4-cyclohexyl-4-oxy-piperazin-1-yl)-2-oxo-ethyl]-amide | CHEMBL363757
TypeSmall organic molecule
Emp. Form.C29H37ClN4O3
Mol. Mass.525.082
SMILES[O-][N+]1(CCN(CC1)C(=O)[C@@H](Cc1ccc(Cl)cc1)NC(=O)C1Cc2ccccc2CN1)C1CCCCC1