Reaction Details
TargetHigh affinity cAMP-specific 3',5'-cyclic phosphodiesterase 7A
LigandBDBM50151638
Substrate/Competitorn/a
Meas. Tech.ChEMBL_306340 (CHEMBL828160)
IC50 3.5±n/a nM
Citation Bernardelli, PLorthiois, EVergne, FOliveira, CMafroud, AKProust, EPham, NDucrot, PMoreau, FIdrissi, MTertre, ABertin, BCoupe, MChevalier, EDescours, ABerlioz-Seux, FBerna, PLi, M Spiroquinazolinones as novel, potent, and selective PDE7 inhibitors. Part 2: Optimization of 5,8-disubstituted derivatives. Bioorg Med Chem Lett14:4627-31 (2004) 
 
High affinity cAMP-specific 3',5'-cyclic phosphodiesterase 7A
Name:High affinity cAMP-specific 3',5'-cyclic phosphodiesterase 7A
Type:Enzyme
Mol. Mass.:55514.96
Organism:Homo sapiens (Human)
Description:Q13946
Residue:482
BDBM50151638
NameBDBM50151638
Synonyms:8''-chloro-5''-(5-hydroxy-1,2,4-oxadiazol-3-ylmethoxy)spiro[cyclohexane-1,4''-(1'',2'',3'',4''-tetrahydroquinazoline)]-2''-one | CHEMBL182536
TypeSmall organic molecule
Emp. Form.C16H17ClN4O4
Mol. Mass.364.784
SMILESClc1ccc(OCc2nc(=O)o[nH]2)c2c1NC(=O)NC21CCCCC1