Reaction Details
TargetDipeptidyl peptidase 4
LigandBDBM50151798
Substrate/Competitorn/a
Meas. Tech.ChEMBL_304966 (CHEMBL827095)
IC50 0.1±n/a nM
Citation Xu, JOk, HOGonzalez, EJColwell, LFHabulihaz, BHe, HLeiting, BLyons, KAMarsilio, FPatel, RAWu, JKThornberry, NAWeber, AEParmee, ER Discovery of potent and selective beta-homophenylalanine based dipeptidyl peptidase IV inhibitors. Bioorg Med Chem Lett14:4759-62 (2004) 
 
Dipeptidyl peptidase 4
Name:Dipeptidyl peptidase 4
Type:Enzyme
Mol. Mass.:88271.01
Organism:Homo sapiens (Human)
Description:P27487
Residue:766
BDBM50151798
NameBDBM50151798
Synonyms:CHEMBL186877 | [6-(2,4-Dichloro-phenyl)-2-(3,5-dimethoxy-phenyl)-5-dimethylaminomethyl-pyrimidin-4-yl]-dimethyl-amine
TypeSmall organic molecule
Emp. Form.C23H26Cl2N4O2
Mol. Mass.461.384
SMILESCOc1cc(OC)cc(c1)-c1nc(N(C)C)c(CN(C)C)c(n1)-c1ccc(Cl)cc1Cl