Reaction Details
TargetSensory histidine kinase DcuS
LigandBDBM50151875
Substrate/Competitorn/a
Meas. Tech.ChEMBL_305474 (CHEMBL831083)
IC50 4000±n/a nM
Citation Chan, WCCoyle, BJWilliams, P Virulence regulation and quorum sensing in staphylococcal infections: competitive AgrC antagonists as quorum sensing inhibitors. J Med Chem47:4633-41 (2004) 
 
Sensory histidine kinase DcuS
Name:Sensory histidine kinase DcuS
Synonyms:Receptor-histidine kinase AgrC
Type:PROTEIN
Mol. Mass.:49890.25
Organism:Staphylococcus aureus
Description:ChEMBL_305973
Residue:430
BDBM50151875
NameBDBM50151875
TypeSmall organic molecule
Emp. Form.C26H37N5O8S
Mol. Mass.579.666
SMILESCC(C)C[C@H]1NC(=O)[C@H](CO)NC(=O)[C@@H](CO)NC(=O)[C@@H](CSC(=O)[C@H](Cc2ccccc2)NC1=O)NC(C)=O