Reaction Details
TargetSensory histidine kinase DcuS
LigandBDBM50151871
Substrate/Competitorn/a
Meas. Tech.ChEMBL_305474 (CHEMBL831083)
IC50 10.00±n/a nM
Citation Chan, WCCoyle, BJWilliams, P Virulence regulation and quorum sensing in staphylococcal infections: competitive AgrC antagonists as quorum sensing inhibitors. J Med Chem47:4633-41 (2004) 
 
Sensory histidine kinase DcuS
Name:Sensory histidine kinase DcuS
Synonyms:Receptor-histidine kinase AgrC
Type:PROTEIN
Mol. Mass.:49890.25
Organism:Staphylococcus aureus
Description:ChEMBL_305973
Residue:430
BDBM50151871
NameBDBM50151871
TypeSmall organic molecule
Emp. Form.C40H56N8O13S
Mol. Mass.888.983
SMILESCC(C)C[C@H]1NC(=O)[C@H](CO)NC(=O)[C@@H](CO)NC(=O)[C@@H](CSC(=O)[C@H](Cc2ccccc2)NC1=O)NC(=O)[C@@H](NC(=O)[C@H](CO)NC(=O)[C@@H](N)Cc1ccc(O)cc1)[C@@H](C)O