Reaction Details
TargetB1 bradykinin receptor
LigandBDBM50151888
Substrate/Competitorn/a
Meas. Tech.ChEMBL_302842 (CHEMBL827887)
Ki 130±n/a nM
Citation Ritchie, TJDziadulewicz, EKCulshaw, AJMüller, WBurgess, GMBloomfield, GCDrake, GSDunstan, ARBeattie, DHughes, GAGanju, PMcIntyre, PBevan, SJDavis, CYaqoob, M Potent and orally bioavailable non-peptide antagonists at the human bradykinin B(1) receptor based on a 2-alkylamino-5-sulfamoylbenzamide core. J Med Chem47:4642-4 (2004) 
 
B1 bradykinin receptor
Name:B1 bradykinin receptor
Type:Enzyme
Mol. Mass.:40508.87
Organism:Homo sapiens (Human)
Description:P46663
Residue:353
BDBM50151888
NameBDBM50151888
Synonyms:3-[3-Acetyl-4-(2,2-diphenyl-ethylamino)-benzenesulfonylamino]-N,N-bis-(3-dimethylamino-propyl)-propionamide | CHEMBL365009
TypeSmall organic molecule
Emp. Form.C35H49N5O4S
Mol. Mass.635.86
SMILESCN(C)CCCN(CCCN(C)C)C(=O)CCNS(=O)(=O)c1ccc(NCC(c2ccccc2)c2ccccc2)c(c1)C(C)=O