Reaction Details
TargetB1 bradykinin receptor
LigandBDBM50151890
Substrate/Competitorn/a
Meas. Tech.ChEMBL_302842 (CHEMBL827887)
Ki 230±n/a nM
Citation Ritchie, TJDziadulewicz, EKCulshaw, AJMüller, WBurgess, GMBloomfield, GCDrake, GSDunstan, ARBeattie, DHughes, GAGanju, PMcIntyre, PBevan, SJDavis, CYaqoob, M Potent and orally bioavailable non-peptide antagonists at the human bradykinin B(1) receptor based on a 2-alkylamino-5-sulfamoylbenzamide core. J Med Chem47:4642-4 (2004) 
 
B1 bradykinin receptor
Name:B1 bradykinin receptor
Type:Enzyme
Mol. Mass.:40508.87
Organism:Homo sapiens (Human)
Description:P46663
Residue:353
BDBM50151890
NameBDBM50151890
Synonyms:CHEMBL181098 | N,N-Bis-(3-dimethylamino-propyl)-4-(2,2-diphenyl-ethylamino)-3-nitro-benzenesulfonamide
TypeSmall organic molecule
Emp. Form.C30H41N5O4S
Mol. Mass.567.743
SMILESCN(C)CCCN(CCCN(C)C)S(=O)(=O)c1ccc(NCC(c2ccccc2)c2ccccc2)c(c1)[N+]([O-])=O