Reaction Details
TargetB1 bradykinin receptor
LigandBDBM50151892
Substrate/Competitorn/a
Meas. Tech.ChEMBL_302842 (CHEMBL827887)
Ki>1000±n/a nM
Citation Ritchie, TJDziadulewicz, EKCulshaw, AJMüller, WBurgess, GMBloomfield, GCDrake, GSDunstan, ARBeattie, DHughes, GAGanju, PMcIntyre, PBevan, SJDavis, CYaqoob, M Potent and orally bioavailable non-peptide antagonists at the human bradykinin B(1) receptor based on a 2-alkylamino-5-sulfamoylbenzamide core. J Med Chem47:4642-4 (2004) 
 
B1 bradykinin receptor
Name:B1 bradykinin receptor
Type:Enzyme
Mol. Mass.:40508.87
Organism:Homo sapiens (Human)
Description:P46663
Residue:353
BDBM50151892
NameBDBM50151892
Synonyms:3-[3-Chloro-4-(2,2-diphenyl-ethylamino)-benzenesulfonylamino]-N,N-bis-(3-dimethylamino-propyl)-propionamide | CHEMBL171608
TypeSmall organic molecule
Emp. Form.C33H46ClN5O3S
Mol. Mass.628.268
SMILESCN(C)CCCN(CCCN(C)C)C(=O)CCNS(=O)(=O)c1ccc(NCC(c2ccccc2)c2ccccc2)c(Cl)c1