Reaction Details
TargetB2 bradykinin receptor
LigandBDBM50151887
Substrate/Competitorn/a
Meas. Tech.ChEMBL_302814 (CHEMBL839504)
Ki 1400±n/a nM
Citation Ritchie, TJDziadulewicz, EKCulshaw, AJMüller, WBurgess, GMBloomfield, GCDrake, GSDunstan, ARBeattie, DHughes, GAGanju, PMcIntyre, PBevan, SJDavis, CYaqoob, M Potent and orally bioavailable non-peptide antagonists at the human bradykinin B(1) receptor based on a 2-alkylamino-5-sulfamoylbenzamide core. J Med Chem47:4642-4 (2004) 
 
B2 bradykinin receptor
Name:B2 bradykinin receptor
Type:Enzyme Catalytic Domain
Mol. Mass.:44467.17
Organism:Homo sapiens (Human)
Description:B2 BRADYKININ BDKRB2 HUMAN::P30411
Residue:391
BDBM50151887
NameBDBM50151887
Synonyms:4-(Benzhydryl-amino)-N,N-bis-(3-dimethylamino-propyl)-3-nitro-benzenesulfonamide | CHEMBL185068
TypeSmall organic molecule
Emp. Form.C29H39N5O4S
Mol. Mass.553.716
SMILESCN(C)CCCN(CCCN(C)C)S(=O)(=O)c1ccc(NC(c2ccccc2)c2ccccc2)c(c1)[N+]([O-])=O