Reaction Details
TargetD(2) dopamine receptor
LigandBDBM50151953
Substrate/Competitorn/a
Meas. Tech.ChEBML_305865
IC50>100±n/a nM
Citation Heinrich, TBöttcher, HBartoszyk, GDGreiner, HESeyfried, CAVan Amsterdam, C Indolebutylamines as selective 5-HT(1A) agonists. J Med Chem47:4677-83 (2004) 
 
D(2) dopamine receptor
Name:D(2) dopamine receptor
Type:G Protein-Coupled Receptor (GPCR)
Mol. Mass.:50931.60
Organism:Rattus norvegicus (rat)
Description:P61169
Residue:444
BDBM50151953
NameBDBM50151953
Synonyms:3-{4-[4-(4-Ethoxy-phenyl)-piperazin-1-yl]-butyl}-5-methoxy-1H-indole | CHEMBL188471
TypeSmall organic molecule
Emp. Form.C25H33N3O2
Mol. Mass.407.5484
SMILESCCOc1ccc(cc1)N1CCN(CCCCc2c[nH]c3ccc(OC)cc23)CC1