Reaction Details
Target5-hydroxytryptamine receptor 1A
LigandBDBM50151953
Substrate/Competitorn/a
Meas. Tech.ChEBML_306314
IC50 0.800000±n/a nM
Citation Heinrich, TBöttcher, HBartoszyk, GDGreiner, HESeyfried, CAVan Amsterdam, C Indolebutylamines as selective 5-HT(1A) agonists. J Med Chem47:4677-83 (2004) 
 
5-hydroxytryptamine receptor 1A
Name:5-hydroxytryptamine receptor 1A
Type:G Protein-Coupled Receptor (GPCR)
Mol. Mass.:46445.29
Organism:Rattus norvegicus (rat)
Description:Binding assays were performed using rat hippocampal membranes.
Residue:422
BDBM50151953
NameBDBM50151953
Synonyms:3-{4-[4-(4-Ethoxy-phenyl)-piperazin-1-yl]-butyl}-5-methoxy-1H-indole | CHEMBL188471
TypeSmall organic molecule
Emp. Form.C25H33N3O2
Mol. Mass.407.5484
SMILESCCOc1ccc(cc1)N1CCN(CCCCc2c[nH]c3ccc(OC)cc23)CC1