Reaction Details
Target5-hydroxytryptamine receptor 1A
LigandBDBM50151983
Substrate/Competitorn/a
Meas. Tech.ChEBML_306315
IC50 0.100000±n/a nM
Citation Heinrich, TBöttcher, HGericke, RBartoszyk, GDAnzali, SSeyfried, CAGreiner, HEVan Amsterdam, C Synthesis and structure--activity relationship in a class of indolebutylpiperazines as dual 5-HT(1A) receptor agonists and serotonin reuptake inhibitors. J Med Chem47:4684-92 (2004) 
 
5-hydroxytryptamine receptor 1A
Name:5-hydroxytryptamine receptor 1A
Type:G Protein-Coupled Receptor (GPCR)
Mol. Mass.:46445.29
Organism:Rattus norvegicus (rat)
Description:Binding assays were performed using rat hippocampal membranes.
Residue:422
BDBM50151983
NameBDBM50151983
Synonyms:3-{4-[4-(2-Oxo-2H-chromen-6-yl)-piperazin-1-yl]-butyl}-1H-indole-5-carbonitrile | CHEMBL189704
TypeSmall organic molecule
Emp. Form.C26H26N4O2
Mol. Mass.426.5102
SMILESO=c1ccc2cc(ccc2o1)N1CCN(CCCCc2c[nH]c3ccc(cc23)C#N)CC1