Reaction Details
TargetD(2) dopamine receptor
LigandBDBM50151999
Substrate/Competitorn/a
Meas. Tech.ChEBML_305866
IC50 40±n/a nM
Citation Heinrich, TBöttcher, HGericke, RBartoszyk, GDAnzali, SSeyfried, CAGreiner, HEVan Amsterdam, C Synthesis and structure--activity relationship in a class of indolebutylpiperazines as dual 5-HT(1A) receptor agonists and serotonin reuptake inhibitors. J Med Chem47:4684-92 (2004) 
 
D(2) dopamine receptor
Name:D(2) dopamine receptor
Type:G Protein-Coupled Receptor (GPCR)
Mol. Mass.:50931.60
Organism:Rattus norvegicus (rat)
Description:P61169
Residue:444
BDBM50151999
NameBDBM50151999
Synonyms:3-{4-[4-(3,4-Dimethoxy-phenyl)-piperazin-1-yl]-butyl}-1H-indole-5-carbonitrile | CHEMBL184162
TypeSmall organic molecule
Emp. Form.C25H30N4O2
Mol. Mass.418.5313
SMILESCOc1ccc(cc1OC)N1CCN(CCCCc2c[nH]c3ccc(cc23)C#N)CC1