Reaction Details
TargetD(2) dopamine receptor
LigandBDBM50152014
Substrate/Competitorn/a
Meas. Tech.ChEBML_305866
IC50>270±n/a nM
Citation Heinrich, TBöttcher, HGericke, RBartoszyk, GDAnzali, SSeyfried, CAGreiner, HEVan Amsterdam, C Synthesis and structure--activity relationship in a class of indolebutylpiperazines as dual 5-HT(1A) receptor agonists and serotonin reuptake inhibitors. J Med Chem47:4684-92 (2004) 
 
D(2) dopamine receptor
Name:D(2) dopamine receptor
Type:G Protein-Coupled Receptor (GPCR)
Mol. Mass.:50931.60
Organism:Rattus norvegicus (rat)
Description:P61169
Residue:444
BDBM50152014
NameBDBM50152014
Synonyms:4-{4-[4-(5-Cyano-1H-indol-3-yl)-butyl]-piperazin-1-yl}-benzamide | CHEMBL187909
TypeSmall organic molecule
Emp. Form.C24H27N5O
Mol. Mass.401.5041
SMILESNC(=O)c1ccc(cc1)N1CCN(CCCCc2c[nH]c3ccc(cc23)C#N)CC1