Reaction Details
Target5-hydroxytryptamine receptor 1A
LigandBDBM50151999
Substrate/Competitorn/a
Meas. Tech.ChEBML_306315
IC50 60±n/a nM
Citation Heinrich, TBöttcher, HGericke, RBartoszyk, GDAnzali, SSeyfried, CAGreiner, HEVan Amsterdam, C Synthesis and structure--activity relationship in a class of indolebutylpiperazines as dual 5-HT(1A) receptor agonists and serotonin reuptake inhibitors. J Med Chem47:4684-92 (2004) 
 
5-hydroxytryptamine receptor 1A
Name:5-hydroxytryptamine receptor 1A
Type:G Protein-Coupled Receptor (GPCR)
Mol. Mass.:46445.29
Organism:Rattus norvegicus (rat)
Description:Binding assays were performed using rat hippocampal membranes.
Residue:422
BDBM50151999
NameBDBM50151999
Synonyms:3-{4-[4-(3,4-Dimethoxy-phenyl)-piperazin-1-yl]-butyl}-1H-indole-5-carbonitrile | CHEMBL184162
TypeSmall organic molecule
Emp. Form.C25H30N4O2
Mol. Mass.418.5313
SMILESCOc1ccc(cc1OC)N1CCN(CCCCc2c[nH]c3ccc(cc23)C#N)CC1