Reaction Details
Target5-hydroxytryptamine receptor 1A
LigandBDBM50151994
Substrate/Competitorn/a
Meas. Tech.ChEBML_306315
IC50 0.200000±n/a nM
Citation Heinrich, TBöttcher, HGericke, RBartoszyk, GDAnzali, SSeyfried, CAGreiner, HEVan Amsterdam, C Synthesis and structure--activity relationship in a class of indolebutylpiperazines as dual 5-HT(1A) receptor agonists and serotonin reuptake inhibitors. J Med Chem47:4684-92 (2004) 
 
5-hydroxytryptamine receptor 1A
Name:5-hydroxytryptamine receptor 1A
Type:G Protein-Coupled Receptor (GPCR)
Mol. Mass.:46445.29
Organism:Rattus norvegicus (rat)
Description:Binding assays were performed using rat hippocampal membranes.
Residue:422
BDBM50151994
NameBDBM50151994
Synonyms:3-{4-[4-(2,3-Dihydro-benzo[1,4]dioxin-6-yl)-piperazin-1-yl]-butyl}-1H-indol-5-ol | CHEMBL363055
TypeSmall organic molecule
Emp. Form.C24H29N3O3
Mol. Mass.407.5054
SMILESOc1ccc2[nH]cc(CCCCN3CCN(CC3)c3ccc4OCCOc4c3)c2c1