Reaction Details
TargetD(2) dopamine receptor
LigandBDBM50152022
Substrate/Competitorn/a
Meas. Tech.ChEBML_305866
IC50 4.9±n/a nM
Citation Heinrich, TBöttcher, HGericke, RBartoszyk, GDAnzali, SSeyfried, CAGreiner, HEVan Amsterdam, C Synthesis and structure--activity relationship in a class of indolebutylpiperazines as dual 5-HT(1A) receptor agonists and serotonin reuptake inhibitors. J Med Chem47:4684-92 (2004) 
 
D(2) dopamine receptor
Name:D(2) dopamine receptor
Type:G Protein-Coupled Receptor (GPCR)
Mol. Mass.:50931.60
Organism:Rattus norvegicus (rat)
Description:P61169
Residue:444
BDBM50152022
NameBDBM50152022
Synonyms:3-[4-(4-Benzo[1,3]dioxol-5-yl-piperazin-1-yl)-butyl]-1H-indole-5-carbonitrile | CHEMBL188799
TypeSmall organic molecule
Emp. Form.C24H26N4O2
Mol. Mass.402.4888
SMILESN#Cc1ccc2[nH]cc(CCCCN3CCN(CC3)c3ccc4OCOc4c3)c2c1