Reaction Details
Target5-hydroxytryptamine receptor 1A
LigandBDBM50151982
Substrate/Competitorn/a
Meas. Tech.ChEBML_306315
IC50 0.300000±n/a nM
Citation Heinrich, TBöttcher, HGericke, RBartoszyk, GDAnzali, SSeyfried, CAGreiner, HEVan Amsterdam, C Synthesis and structure--activity relationship in a class of indolebutylpiperazines as dual 5-HT(1A) receptor agonists and serotonin reuptake inhibitors. J Med Chem47:4684-92 (2004) 
 
5-hydroxytryptamine receptor 1A
Name:5-hydroxytryptamine receptor 1A
Type:G Protein-Coupled Receptor (GPCR)
Mol. Mass.:46445.29
Organism:Rattus norvegicus (rat)
Description:Binding assays were performed using rat hippocampal membranes.
Residue:422
BDBM50151982
NameBDBM50151982
Synonyms:5-{4-[4-(5-Cyano-1H-indol-3-yl)-butyl]-piperazin-1-yl}-benzofuran-2-carboxylic acid amide VILAZODONE
TypeSmall organic molecule
Emp. Form.C26H27N5O2
Mol. Mass.441.5249
SMILESNC(=O)c1cc2cc(ccc2o1)N1CCN(CCCCc2c[nH]c3ccc(cc23)C#N)CC1