Reaction Details
TargetSodium-dependent serotonin transporter
LigandBDBM50152022
Substrate/Competitorn/a
Meas. Tech.ChEBML_306182
IC50 0.600000±n/a nM
Citation Heinrich, TBöttcher, HGericke, RBartoszyk, GDAnzali, SSeyfried, CAGreiner, HEVan Amsterdam, C Synthesis and structure--activity relationship in a class of indolebutylpiperazines as dual 5-HT(1A) receptor agonists and serotonin reuptake inhibitors. J Med Chem47:4684-92 (2004) 
 
Sodium-dependent serotonin transporter
Name:Sodium-dependent serotonin transporter
Type:Multi-pass membrane protein
Mol. Mass.:70168.43
Organism:Rattus norvegicus (rat)
Description:P31652
Residue:630
BDBM50152022
NameBDBM50152022
Synonyms:3-[4-(4-Benzo[1,3]dioxol-5-yl-piperazin-1-yl)-butyl]-1H-indole-5-carbonitrile | CHEMBL188799
TypeSmall organic molecule
Emp. Form.C24H26N4O2
Mol. Mass.402.4888
SMILESN#Cc1ccc2[nH]cc(CCCCN3CCN(CC3)c3ccc4OCOc4c3)c2c1