Reaction Details
TargetSolute carrier family 15 member 1
LigandBDBM50152063
Substrate/Competitorn/a
Meas. Tech.ChEMBL_306163 (CHEMBL831529)
IC50 134000±n/a nM
Citation Våbenø, JNielsen, CUIngebrigtsen, TLejon, TSteffansen, BLuthman, K Dipeptidomimetic ketomethylene isosteres as pro-moieties for drug transport via the human intestinal di-/tripeptide transporter hPEPT1: design, synthesis, stability, and biological investigations. J Med Chem47:4755-65 (2004) 
 
Solute carrier family 15 member 1
Name:Solute carrier family 15 member 1
Type:PROTEIN
Mol. Mass.:78818.07
Organism:Homo sapiens (Human)
Description:ChEMBL_1488839
Residue:708
BDBM50152063
NameBDBM50152063
Synonyms:5-Amino-6-methyl-4-oxo-heptanoic acid benzyl ester | CHEMBL189248
TypeSmall organic molecule
Emp. Form.C15H21NO3
Mol. Mass.263.3321
SMILESCC(C)[C@H](N)C(=O)CCC(=O)OCc1ccccc1