Reaction Details
TargetCorticotropin-releasing factor receptor 1
LigandBDBM50152185
Substrate/Competitorn/a
Meas. Tech.ChEMBL_303525 (CHEMBL839639)
Ki 4.2±n/a nM
Citation Chen, CWilcoxen, KMHuang, CQXie, YFMcCarthy, JRWebb, TRZhu, YFSaunders, JLiu, XJChen, TKBozigian, HGrigoriadis, DE Design of 2,5-dimethyl-3-(6-dimethyl-4-methylpyridin-3-yl)-7-dipropylaminopyrazolo[1,5-a]pyrimidine (NBI 30775/R121919) and structure--activity relationships of a series of potent and orally active corticotropin-releasing factor receptor antagonists. J Med Chem47:4787-98 (2004) 
 
Corticotropin-releasing factor receptor 1
Name:Corticotropin-releasing factor receptor 1
Type:Enzyme
Mol. Mass.:50744.31
Organism:Homo sapiens (Human)
Description:P34998
Residue:444
BDBM50152185
NameBDBM50152185
Synonyms:CHEMBL360851 | Dibutyl-[3-(6-dimethylamino-4-methyl-pyridin-3-yl)-2,5-dimethyl-pyrazolo[1,5-a]pyrimidin-7-yl]-amine
TypeSmall organic molecule
Emp. Form.C24H36N6
Mol. Mass.408.5828
SMILESCCCCN(CCCC)c1cc(C)nc2c(c(C)nn12)-c1cnc(cc1C)N(C)C