Reaction Details
TargetAdenosine receptor A2a
LigandBDBM50152214
Substrate/Competitorn/a
Meas. Tech.ChEMBL_303573 (CHEMBL828973)
Ki 11±n/a nM
Citation Vu, CBPan, DPeng, BSha, LKumaravel, GJin, XPhadke, DEngber, THuang, CReilly, JTam, SPetter, RC Studies on adenosine A2a receptor antagonists: comparison of three core heterocycles. Bioorg Med Chem Lett14:4831-4 (2004) 
 
Adenosine receptor A2a
Name:Adenosine receptor A2a
Type:G Protein-Coupled Receptor (GPCR)
Mol. Mass.:45015.65
Organism:Rattus norvegicus (rat)
Description:Rat A2A receptors expressed in CHO cells.
Residue:410
BDBM50152214
NameBDBM50152214
Synonyms:2-Furan-2-yl-N*5*-methyl-N*5*-[(R)-1-(5-methyl-isoxazol-3-ylmethyl)-pyrrolidin-2-ylmethyl]-[1,2,4]triazolo[1,5-a]pyrimidine-5,7-diamine | CHEMBL360166
TypeSmall organic molecule
Emp. Form.C20H24N8O2
Mol. Mass.408.457
SMILESCN(C[C@H]1CCCN1Cc1cc(C)on1)c1cc(N)n2nc(nc2n1)-c1ccco1