Reaction Details
TargetAdenosine receptor A2a
LigandBDBM50151182
Substrate/Competitorn/a
Meas. Tech.ChEMBL_303227 (CHEMBL827192)
Ki 3±n/a nM
Citation Vu, CBShields, PPeng, BKumaravel, GJin, XPhadke, DWang, JEngber, TAyyub, EPetter, RC Triamino derivatives of triazolotriazine and triazolopyrimidine as adenosine A2a receptor antagonists. Bioorg Med Chem Lett14:4835-8 (2004) 
 
Adenosine receptor A2a
Name:Adenosine receptor A2a
Type:G Protein-Coupled Receptor (GPCR)
Mol. Mass.:45015.65
Organism:Rattus norvegicus (rat)
Description:Rat A2A receptors expressed in CHO cells.
Residue:410
BDBM50151182
NameBDBM50151182
Synonyms:2-Furan-2-yl-5-[4-(2,4,6-trifluoro-benzyl)-piperazin-1-yl]-[1,2,4]triazolo[1,5-a][1,3,5]triazin-7-ylamine | CHEMBL173941
TypeSmall organic molecule
Emp. Form.C19H17F3N8O
Mol. Mass.430.3865
SMILESNc1nc(nc2nc(nn12)-c1ccco1)N1CCN(Cc2c(F)cc(F)cc2F)CC1