Reaction Details
TargetAdenosine receptor A2a
LigandBDBM50152240
Substrate/Competitorn/a
Meas. Tech.ChEMBL_303227 (CHEMBL827192)
Ki 4±n/a nM
Citation Vu, CBShields, PPeng, BKumaravel, GJin, XPhadke, DWang, JEngber, TAyyub, EPetter, RC Triamino derivatives of triazolotriazine and triazolopyrimidine as adenosine A2a receptor antagonists. Bioorg Med Chem Lett14:4835-8 (2004) 
 
Adenosine receptor A2a
Name:Adenosine receptor A2a
Type:G Protein-Coupled Receptor (GPCR)
Mol. Mass.:45015.65
Organism:Rattus norvegicus (rat)
Description:Rat A2A receptors expressed in CHO cells.
Residue:410
BDBM50152240
NameBDBM50152240
Synonyms:CHEMBL184309 | N*5*-{2-[4-(2,4-Difluoro-phenyl)-piperazin-1-yl]-ethyl}-2-furan-2-yl-N*5*-methyl-[1,2,4]triazolo[1,5-a][1,3,5]triazine-5,7-diamine
TypeSmall organic molecule
Emp. Form.C21H23F2N9O
Mol. Mass.455.4638
SMILESCN(CCN1CCN(CC1)c1ccc(F)cc1F)c1nc(N)n2nc(nc2n1)-c1ccco1