Reaction Details
TargetPlatelet-derived growth factor receptor beta
LigandBDBM50152358
Substrate/Competitorn/a
Meas. Tech.ChEMBL_306667 (CHEMBL832268)
IC50 5±n/a nM
Citation Heath, JAMehrotra, MMChi, SYu, JCHutchaleelaha, AHollenbach, SJGiese, NAScarborough, RMPandey, A Identification of 4-piperazin-1-yl-quinazoline template based aryl and benzyl thioureas as potent, selective, and orally bioavailable inhibitors of platelet-derived growth factor (PDGF) receptor. Bioorg Med Chem Lett14:4867-72 (2004) 
 
Platelet-derived growth factor receptor beta
Name:Platelet-derived growth factor receptor beta
Type:Enzyme
Mol. Mass.:123922.25
Organism:Homo sapiens (Human)
Description:P09619
Residue:1106
BDBM50152358
NameBDBM50152358
Synonyms:4-[6-Methoxy-7-(2-pyrrolidin-1-yl-ethoxy)-quinazolin-4-yl]-piperazine-1-carbothioic acid (benzo[1,3]dioxol-5-ylmethyl)-amide | CHEMBL184078
TypeSmall organic molecule
Emp. Form.C28H34N6O4S
Mol. Mass.550.672
SMILESCOc1cc2c(ncnc2cc1OCCN1CCCC1)N1CCN(CC1)C(=S)NCc1ccc2OCOc2c1