Reaction Details
TargetPlatelet-derived growth factor receptor beta
LigandBDBM50152361
Substrate/Competitorn/a
Meas. Tech.ChEMBL_306667 (CHEMBL832268)
IC50 5±n/a nM
Citation Heath, JAMehrotra, MMChi, SYu, JCHutchaleelaha, AHollenbach, SJGiese, NAScarborough, RMPandey, A Identification of 4-piperazin-1-yl-quinazoline template based aryl and benzyl thioureas as potent, selective, and orally bioavailable inhibitors of platelet-derived growth factor (PDGF) receptor. Bioorg Med Chem Lett14:4867-72 (2004) 
 
Platelet-derived growth factor receptor beta
Name:Platelet-derived growth factor receptor beta
Type:Enzyme
Mol. Mass.:123922.25
Organism:Homo sapiens (Human)
Description:P09619
Residue:1106
BDBM50152361
NameBDBM50152361
Synonyms:4-[3-Cyano-6-methoxy-7-(3-piperidin-1-yl-propoxy)-quinolin-4-yl]-piperazine-1-carbothioic acid (4-cyano-phenyl)-amide | CHEMBL186719
TypeSmall organic molecule
Emp. Form.C31H35N7O2S
Mol. Mass.569.72
SMILESCOc1cc2c(N3CCN(CC3)C(=S)Nc3ccc(cc3)C#N)c(cnc2cc1OCCCN1CCCCC1)C#N