Reaction Details
TargetPlatelet-derived growth factor receptor beta
LigandBDBM50152373
Substrate/Competitorn/a
Meas. Tech.ChEMBL_306667 (CHEMBL832268)
IC50 420±n/a nM
Citation Heath, JAMehrotra, MMChi, SYu, JCHutchaleelaha, AHollenbach, SJGiese, NAScarborough, RMPandey, A Identification of 4-piperazin-1-yl-quinazoline template based aryl and benzyl thioureas as potent, selective, and orally bioavailable inhibitors of platelet-derived growth factor (PDGF) receptor. Bioorg Med Chem Lett14:4867-72 (2004) 
 
Platelet-derived growth factor receptor beta
Name:Platelet-derived growth factor receptor beta
Type:Enzyme
Mol. Mass.:123922.25
Organism:Homo sapiens (Human)
Description:P09619
Residue:1106
BDBM50152373
NameBDBM50152373
Synonyms:4-[4-(N-Substituted-thio-carbamoyl)-1-piperazinyl]-6-methoxy-7-alkoxyamino-quinazoline derivative | CHEMBL184913
TypeSmall organic molecule
Emp. Form.C34H39N9O2
Mol. Mass.605.7326
SMILESCOc1cc2c(ncnc2cc1OCCCN1CCCCC1)N1CCN(CC1)C(Nc1ccc(cc1)-c1ccccn1)=NC#N