Reaction Details
TargetMelanin-concentrating hormone receptor 1
LigandBDBM50152456
Substrate/Competitorn/a
Meas. Tech.ChEMBL_306737 (CHEMBL832324)
IC50 3±n/a nM
Citation Vasudevan, AWodka, DVerzal, MKSouers, AJGao, JBrodjian, SFry, DDayton, BMarsh, KCHernandez, LEOgiela, CACollins, CAKym, PR Synthesis and evaluation of 2-amino-8-alkoxy quinolines as MCHr1 antagonists. Part 2. Bioorg Med Chem Lett14:4879-82 (2004) 
 
Melanin-concentrating hormone receptor 1
Name:Melanin-concentrating hormone receptor 1
Type:G Protein-Coupled Receptor (GPCR)
Mol. Mass.:45976.27
Organism:Homo sapiens (Human)
Description:Membranes from CHO-K1 cells stably expressing human MCH1R were used in assays.
Residue:422
BDBM50152456
NameBDBM50152456
Synonyms:(S)-3-{3-[4-(3-Acetylamino-phenyl)-piperidin-1-yl]-propylcarbamoyl}-4-(3,4-difluoro-phenyl)-6-methoxymethyl-2-oxo-1,2,3,4-tetrahydro-pyrimidine-5-carboxylic acid methyl ester CHEMBL185271
TypeSmall organic molecule
Emp. Form.C31H37F2N5O6
Mol. Mass.613.6522
SMILESCOCC1=C([C@@H](N(C(=O)NCCCN2CCC(CC2)c2cccc(NC(C)=O)c2)C(=O)N1)c1ccc(F)c(F)c1)C(=O)OC