Reaction Details
TargetMelanin-concentrating hormone receptor 1
LigandBDBM50152479
Substrate/Competitorn/a
Meas. Tech.ChEMBL_306737 (CHEMBL832324)
IC50 0.9±n/a nM
Citation Vasudevan, AWodka, DVerzal, MKSouers, AJGao, JBrodjian, SFry, DDayton, BMarsh, KCHernandez, LEOgiela, CACollins, CAKym, PR Synthesis and evaluation of 2-amino-8-alkoxy quinolines as MCHr1 antagonists. Part 2. Bioorg Med Chem Lett14:4879-82 (2004) 
 
Melanin-concentrating hormone receptor 1
Name:Melanin-concentrating hormone receptor 1
Type:G Protein-Coupled Receptor (GPCR)
Mol. Mass.:45976.27
Organism:Homo sapiens (Human)
Description:Membranes from CHO-K1 cells stably expressing human MCH1R were used in assays.
Residue:422
BDBM50152479
NameBDBM50152479
Synonyms:1-[3-(2-Amino-quinolin-8-yloxy)-propyl]-3-(3-chloro-phenyl)-urea | CHEMBL184417
TypeSmall organic molecule
Emp. Form.C19H19ClN4O2
Mol. Mass.370.833
SMILESNc1ccc2cccc(OCCCNC(=O)Nc3cccc(Cl)c3)c2n1