Reaction Details
TargetProstaglandin D2 receptor
LigandBDBM50152512
Substrate/Competitorn/a
Meas. Tech.ChEMBL_303622 (CHEMBL828877)
Ki 5.3±n/a nM
Citation Torisu, KKobayashi, KIwahashi, MNakai, YOnoda, TNagase, TSugimoto, IOkada, YMatsumoto, RNanbu, FOhuchida, SNakai, HToda, M Discovery of orally active prostaglandin D2 receptor antagonists. Bioorg Med Chem Lett14:4891-5 (2004) 
 
Prostaglandin D2 receptor
Name:Prostaglandin D2 receptor
Type:Enzyme
Mol. Mass.:40288.87
Organism:Homo sapiens (Human)
Description:Q13258
Residue:359
BDBM50152512
NameBDBM50152512
Synonyms:CHEMBL185251 | {1-[4-(7-Fluoro-4-methyl-3,4-dihydro-2H-benzo[1,4]oxazin-2-ylmethoxy)-benzoyl]-2-methyl-1H-indol-4-yl}-acetic acid
TypeSmall organic molecule
Emp. Form.C28H25FN2O5
Mol. Mass.488.5069
SMILESCN1C[C@@H](COc2ccc(cc2)C(=O)n2c(C)cc3c(CC(O)=O)cccc23)Oc2cc(F)ccc12