Reaction Details
TargetProstaglandin D2 receptor
LigandBDBM50152513
Substrate/Competitorn/a
Meas. Tech.ChEMBL_303623 (CHEMBL828834)
Ki 1.8±n/a nM
Citation Torisu, KKobayashi, KIwahashi, MNakai, YOnoda, TNagase, TSugimoto, IOkada, YMatsumoto, RNanbu, FOhuchida, SNakai, HToda, M Discovery of orally active prostaglandin D2 receptor antagonists. Bioorg Med Chem Lett14:4891-5 (2004) 
 
Prostaglandin D2 receptor
Name:Prostaglandin D2 receptor
Type:PROTEIN
Mol. Mass.:40018.63
Organism:Mus musculus
Description:ChEMBL_788408
Residue:357
BDBM50152513
NameBDBM50152513
Synonyms:CHEMBL361457 | [2-Methyl-1-(4-phenethyloxy-benzoyl)-1H-indol-4-yl]-acetic acid
TypeSmall organic molecule
Emp. Form.C26H23NO4
Mol. Mass.413.4651
SMILESCc1cc2c(CC(O)=O)cccc2n1C(=O)c1ccc(OCCc2ccccc2)cc1