Reaction Details
TargetDNA excision repair protein ERCC-5
LigandBDBM50083934
Substrate/Competitorn/a
Meas. Tech.ChEMBL_304836 (CHEMBL827924)
IC50 12700±n/a nM
Citation Tumey, LNHuck, BGleason, EWang, JSilver, DBrunden, KBoozer, SRundlett, SSherf, BMurphy, SBailey, ADent, TLeventhal, CHarrington, JBennani, YL The identification and optimization of 2,4-diketobutyric acids as flap endonuclease 1 inhibitors. Bioorg Med Chem Lett14:4915-8 (2004) 
 
DNA excision repair protein ERCC-5
Name:DNA excision repair protein ERCC-5
Type:PROTEIN
Mol. Mass.:133069.11
Organism:Homo sapiens (Human)
Description:ChEMBL_305129
Residue:1186
BDBM50083934
NameBDBM50083934
Synonyms:4-(4-Chloro-phenyl)-2-hydroxy-4-oxo-but-2-enoic acid CHEMBL424806
TypeSmall organic molecule
Emp. Form.C10H7ClO4
Mol. Mass.226.613
SMILESOC(=O)C(=O)CC(=O)c1ccc(Cl)cc1