Reaction Details
TargetFlap endonuclease 1
LigandBDBM50152558
Substrate/Competitorn/a
Meas. Tech.ChEMBL_304758 (CHEMBL829355)
IC50 330±n/a nM
Citation Tumey, LNHuck, BGleason, EWang, JSilver, DBrunden, KBoozer, SRundlett, SSherf, BMurphy, SBailey, ADent, TLeventhal, CHarrington, JBennani, YL The identification and optimization of 2,4-diketobutyric acids as flap endonuclease 1 inhibitors. Bioorg Med Chem Lett14:4915-8 (2004) 
 
Flap endonuclease 1
Name:Flap endonuclease 1
Type:PROTEIN
Mol. Mass.:42602.57
Organism:Homo sapiens (Human)
Description:ChEMBL_1517026
Residue:380
BDBM50152558
NameBDBM50152558
Synonyms:4-(4-Chloro-biphenyl-3-yl)-2,4-dioxo-butyric acid | CHEMBL188067
TypeSmall organic molecule
Emp. Form.C16H11ClO4
Mol. Mass.302.709
SMILESOC(=O)C(=O)CC(=O)c1cc(ccc1Cl)-c1ccccc1