Reaction Details
TargetDNA excision repair protein ERCC-5
LigandBDBM50152566
Substrate/Competitorn/a
Meas. Tech.ChEMBL_304836 (CHEMBL827924)
IC50 3130±n/a nM
Citation Tumey, LNHuck, BGleason, EWang, JSilver, DBrunden, KBoozer, SRundlett, SSherf, BMurphy, SBailey, ADent, TLeventhal, CHarrington, JBennani, YL The identification and optimization of 2,4-diketobutyric acids as flap endonuclease 1 inhibitors. Bioorg Med Chem Lett14:4915-8 (2004) 
 
DNA excision repair protein ERCC-5
Name:DNA excision repair protein ERCC-5
Type:PROTEIN
Mol. Mass.:133069.11
Organism:Homo sapiens (Human)
Description:ChEMBL_305129
Residue:1186
BDBM50152566
NameBDBM50152566
Synonyms:4-[5-(4-tert-Butyl-phenyl)-furan-2-yl]-2,4-dioxo-butyric acid | CHEMBL185566
TypeSmall organic molecule
Emp. Form.C18H18O5
Mol. Mass.314.3325
SMILESCC(C)(C)c1ccc(cc1)-c1ccc(o1)C(=O)CC(=O)C(O)=O