Reaction Details
TargetDNA excision repair protein ERCC-5
LigandBDBM50152568
Substrate/Competitorn/a
Meas. Tech.ChEMBL_304836 (CHEMBL827924)
IC50 9850.0±n/a nM
Citation Tumey, LNHuck, BGleason, EWang, JSilver, DBrunden, KBoozer, SRundlett, SSherf, BMurphy, SBailey, ADent, TLeventhal, CHarrington, JBennani, YL The identification and optimization of 2,4-diketobutyric acids as flap endonuclease 1 inhibitors. Bioorg Med Chem Lett14:4915-8 (2004) 
 
DNA excision repair protein ERCC-5
Name:DNA excision repair protein ERCC-5
Type:PROTEIN
Mol. Mass.:133069.11
Organism:Homo sapiens (Human)
Description:ChEMBL_305129
Residue:1186
BDBM50152568
NameBDBM50152568
Synonyms:4-(2,4-Dichloro-phenyl)-2,4-dioxo-butyric acid | CHEMBL186926
TypeSmall organic molecule
Emp. Form.C10H6Cl2O4
Mol. Mass.261.058
SMILESOC(=O)C(=O)CC(=O)c1ccc(Cl)cc1Cl