Reaction Details
TargetDNA excision repair protein ERCC-5
LigandBDBM50152548
Substrate/Competitorn/a
Meas. Tech.ChEMBL_304836 (CHEMBL827924)
IC50 3240±n/a nM
Citation Tumey, LNHuck, BGleason, EWang, JSilver, DBrunden, KBoozer, SRundlett, SSherf, BMurphy, SBailey, ADent, TLeventhal, CHarrington, JBennani, YL The identification and optimization of 2,4-diketobutyric acids as flap endonuclease 1 inhibitors. Bioorg Med Chem Lett14:4915-8 (2004) 
 
DNA excision repair protein ERCC-5
Name:DNA excision repair protein ERCC-5
Type:PROTEIN
Mol. Mass.:133069.11
Organism:Homo sapiens (Human)
Description:ChEMBL_305129
Residue:1186
BDBM50152548
NameBDBM50152548
Synonyms:4-Biphenyl-3-yl-2,4-dioxo-butyric acid CHEMBL197721
TypeSmall organic molecule
Emp. Form.C16H12O4
Mol. Mass.268.2641
SMILESOC(=O)C(=O)CC(=O)c1cccc(c1)-c1ccccc1