Reaction Details
TargetDNA excision repair protein ERCC-5
LigandBDBM50152553
Substrate/Competitorn/a
Meas. Tech.ChEMBL_304836 (CHEMBL827924)
IC50 900±n/a nM
Citation Tumey, LNHuck, BGleason, EWang, JSilver, DBrunden, KBoozer, SRundlett, SSherf, BMurphy, SBailey, ADent, TLeventhal, CHarrington, JBennani, YL The identification and optimization of 2,4-diketobutyric acids as flap endonuclease 1 inhibitors. Bioorg Med Chem Lett14:4915-8 (2004) 
 
DNA excision repair protein ERCC-5
Name:DNA excision repair protein ERCC-5
Type:PROTEIN
Mol. Mass.:133069.11
Organism:Homo sapiens (Human)
Description:ChEMBL_305129
Residue:1186
BDBM50152553
NameBDBM50152553
Synonyms:4-[5-(4-Chloro-3-fluoro-phenyl)-thiophen-2-yl]-2,4-dioxo-butyric acid | CHEMBL361960
TypeSmall organic molecule
Emp. Form.C14H8ClFO4S
Mol. Mass.326.727
SMILESOC(=O)C(=O)CC(=O)c1ccc(s1)-c1ccc(Cl)c(F)c1