Reaction Details
TargetEstrogen receptor beta
LigandBDBM50152609
Substrate/Competitorn/a
Meas. Tech.ChEMBL_305919 (CHEMBL832634)
IC50 0.35±n/a nM
Citation Collini, MDKaufman, DHManas, ESHarris, HAHenderson, RAXu, ZBUnwalla, RJMiller, CP 7-Substituted 2-phenyl-benzofurans as ER beta selective ligands. Bioorg Med Chem Lett14:4925-9 (2004) 
 
Estrogen receptor beta
Name:Estrogen receptor beta
Type:Protein
Mol. Mass.:59238.43
Organism:Homo sapiens (Human)
Description:Q92731
Residue:530
BDBM50152609
NameBDBM50152609
Synonyms:7-Bromo-2-(3-fluoro-4-hydroxy-phenyl)-benzofuran-5-ol | CHEMBL182850
TypeSmall organic molecule
Emp. Form.C14H8BrFO3
Mol. Mass.323.114
SMILESOc1cc(Br)c2oc(cc2c1)-c1ccc(O)c(F)c1