Reaction Details
TargetGenome polyprotein
LigandBDBM50152754
Substrate/Competitorn/a
Meas. Tech.ChEMBL_302906 (CHEMBL830367)
Ki 70±n/a nM
Citation Yip, YVictor, FLamar, JJohnson, RWang, QMGlass, JIYumibe, NWakulchik, MMunroe, JChen, SH P4 and P1' optimization of bicycloproline P2 bearing tetrapeptidyl alpha-ketoamides as HCV protease inhibitors. Bioorg Med Chem Lett14:5007-11 (2004) 
 
Genome polyprotein
Name:Genome polyprotein
Type:Protein
Mol. Mass.:67067.41
Organism:Hepatitis C virus
Description:A3EZI9
Residue:631
BDBM50152754
NameBDBM50152754
Synonyms:2-((S)-2-{(S)-2-Cyclohexyl-2-[(pyrazine-2-carbonyl)-amino]-acetylamino}-3,3-dimethyl-butyryl)-octahydro-cyclopenta[c]pyrrole-1-carboxylic acid (1-cyclopropylaminooxalyl-butyl)-amide | CHEMBL2371798
TypeSmall organic molecule
Emp. Form.C36H53N7O6
Mol. Mass.679.8493
SMILESCCC[C@H](NC(=O)[C@@H]1C2CCCC2CN1C(=O)[C@@H](NC(=O)[C@@H](NC(=O)c1cnccn1)C1CCCCC1)C(C)(C)C)C(=O)C(=O)NC1CC1