Reaction Details
TargetGenome polyprotein
LigandBDBM50152753
Substrate/Competitorn/a
Meas. Tech.ChEMBL_302906 (CHEMBL830367)
Ki 80±n/a nM
Citation Yip, YVictor, FLamar, JJohnson, RWang, QMGlass, JIYumibe, NWakulchik, MMunroe, JChen, SH P4 and P1' optimization of bicycloproline P2 bearing tetrapeptidyl alpha-ketoamides as HCV protease inhibitors. Bioorg Med Chem Lett14:5007-11 (2004) 
 
Genome polyprotein
Name:Genome polyprotein
Type:Protein
Mol. Mass.:67067.41
Organism:Hepatitis C virus
Description:A3EZI9
Residue:631
BDBM50152753
NameBDBM50152753
Synonyms:(S)-2-((S)-3,3-Dimethyl-2-{(S)-3-methyl-2-[(pyrazine-2-carbonyl)-amino]-pentanoylamino}-butyryl)-octahydro-cyclopenta[c]pyrrole-1-carboxylic acid (1-cyclopropylaminooxalyl-butyl)-amide | CHEMBL2371795
TypeSmall organic molecule
Emp. Form.C34H51N7O6
Mol. Mass.653.812
SMILESCCC[C@H](NC(=O)[C@@H]1C2CCCC2CN1C(=O)[C@@H](NC(=O)[C@@H](NC(=O)c1cnccn1)[C@@H](C)CC)C(C)(C)C)C(=O)C(=O)NC1CC1