Reaction Details
TargetChymotrypsinogen B
LigandBDBM50152752
Substrate/Competitorn/a
Meas. Tech.ChEMBL_302381 (CHEMBL830349)
Ki>50000±n/a nM
Citation Yip, YVictor, FLamar, JJohnson, RWang, QMGlass, JIYumibe, NWakulchik, MMunroe, JChen, SH P4 and P1' optimization of bicycloproline P2 bearing tetrapeptidyl alpha-ketoamides as HCV protease inhibitors. Bioorg Med Chem Lett14:5007-11 (2004) 
 
Chymotrypsinogen B
Name:Chymotrypsinogen B
Type:PROTEIN
Mol. Mass.:27871.19
Organism:Homo sapiens (Human)
Description:ChEMBL_216634
Residue:263
BDBM50152752
NameBDBM50152752
Synonyms:(S)-2-((S)-2-{(S)-3,3-Dimethyl-2-[(pyrazine-2-carbonyl)-amino]-butyrylamino}-3,3-dimethyl-butyryl)-octahydro-cyclopenta[c]pyrrole-1-carboxylic acid (1-cyclopropylaminooxalyl-butyl)-amide | CHEMBL2371797
TypeSmall organic molecule
Emp. Form.C34H51N7O6
Mol. Mass.653.812
SMILESCCC[C@H](NC(=O)[C@@H]1C2CCCC2CN1C(=O)[C@@H](NC(=O)[C@@H](NC(=O)c1cnccn1)C(C)(C)C)C(C)(C)C)C(=O)C(=O)NC1CC1