Reaction Details
TargetFatty acid-binding protein, heart
LigandBDBM50152852
Substrate/Competitorn/a
Meas. Tech.ChEMBL_306095 (CHEMBL830870)
IC50 9800.0±n/a nM
Citation Lehmann, FHaile, SAxen, EMedina, CUppenberg, JSvensson, SLundbäck, TRondahl, LBarf, T Discovery of inhibitors of human adipocyte fatty acid-binding protein, a potential type 2 diabetes target. Bioorg Med Chem Lett14:4445-8 (2004) 
 
Fatty acid-binding protein, heart
Name:Fatty acid-binding protein, heart
Type:PROTEIN
Mol. Mass.:14858.36
Organism:Homo sapiens (Human)
Description:ChEMBL_1463784
Residue:133
BDBM50152852
NameBDBM50152852
Synonyms:3-(5-Bromo-indole-1-sulfonyl)-thiophene-2-carboxylic acid | CHEMBL427320
TypeSmall organic molecule
Emp. Form.C13H8BrNO4S2
Mol. Mass.386.241
SMILESOC(=O)c1sccc1S(=O)(=O)n1ccc2cc(Br)ccc12