Reaction Details
TargetVasopressin V2 receptor
LigandBDBM50152974
Substrate/Competitorn/a
Meas. Tech.ChEMBL_304151 (CHEMBL828131)
EC50 850±n/a nM
Citation Pitt, GRBatt, ARHaigh, RMPenson, AMRobson, PARooker, DPTartar, ALTrim, JEYea, CMRoe, MB Non-peptide oxytocin agonists. Bioorg Med Chem Lett14:4585-9 (2004) 
 
Vasopressin V2 receptor
Name:Vasopressin V2 receptor
Type:Receptor
Mol. Mass.:40295.28
Organism:Homo sapiens (Human)
Description:P30518
Residue:371
BDBM50152974
NameBDBM50152974
Synonyms:(2S)-N-{2-Methyl-4-[(1-methyl-4,10-dihydropyrazolo[3,4-b]-[1,5]benzodiazepin-5(1H)-yl)carbonyl]benzyl}-2-[(4-methyl-1,4-diazepan-1-yl)carbonothioyl]pyrrolidine-1-carboxamide CHEMBL360648
TypeSmall organic molecule
Emp. Form.C32H40N8O2S
Mol. Mass.600.777
SMILESCN1CCCN(CC1)C(=S)[C@@H]1CCCN1C(=O)NCc1ccc(cc1C)C(=O)N1Cc2cnn(C)c2Nc2ccccc12